{"text_format":"1","workbook":"xlsx","n_sheets":3,"sheets":["Data","FitMacro","Table"],"not_rendered":{"charts":1,"images":1,"macros":1,"external_links":0,"defined_names":30,"comments":0,"pivot_tables":0},"unopened":[],"bounds":{"document_bytes":16777216,"sheet_cells":100000,"rows_first":2000,"rows_last":500,"rows_between":2000,"halvings":0,"cell_chars":16384,"cell_head_chars":4096},"cells_cut":0,"cells_raw":0,"read":"whole","date_system":"1900"}

{"sheet":"Data","index":0,"n_rows":28,"n_cols":52,"rows_kept":28,"cut":false,"hidden":false,"merged":[]}
["Drug","2-DG","2-DG","2-DG","2-DG","2-DG","2-DG","2-DG","2-DG","2-DG","2-DG","2-DG","2-DG","2-DG","2-DG","2-DG","2-DG","2-DG","2-DG","AICAR","AICAR","AICAR","AICAR","AICAR","AICAR","AICAR","AICAR","AICAR","AICAR","AICAR","AICAR","AICAR","AICAR","AICAR","AICAR","AICAR","AICAR","Metformin","Metformin","Metformin","Metformin","Metformin","Metformin","Metformin","Metformin","Metformin","Metformin","Metformin","Metformin","Metformin","Metformin","Metformin"]
["DataID","200601_17","200601_17","200601_17","200601_18","200601_18","200601_18","200601_22","200601_22","200601_22","200608_19","200608_19","200608_19","200608_21","200608_21","200608_21","200608_22","200608_22","200608_22","200601_16","200601_16","200601_16","200601_18","200601_18","200601_18","200601_21","200601_21","200601_21","200608_15","200608_15","200608_15","200608_16","200608_16","200608_16","200608_18","200608_18","200608_18","200518_18","200518_18","200518_18","200518_20","200518_20","200518_20","200518_21","200518_21","200518_21","200522_17","200522_17","200522_17","200522_18","200522_18","200522_18"]
["Layer","GCL","IPL","PRS","GCL","IPL","PRS","GCL","IPL","PRS","GCL","IPL","PRS","GCL","IPL","PRS","GCL","IPL","PRS","GCL","IPL","PRS","GCL","IPL","PRS","GCL","IPL","PRS","GCL","IPL","PRS","GCL","IPL","PRS","GCL","IPL","PRS","GCL","IPL","PRS","GCL","IPL","PRS","GCL","IPL","PRS","GCL","IPL","PRS","GCL","IPL","PRS"]
[-30,0.69399999999999995,0.76100000000000001,0.66,0.69799999999999995,0.74399999999999999,0.66800000000000004,0.68700000000000006,0.74299999999999999,0.68,0.68799999999999994,0.747,0.67700000000000005,0.71199999999999997,0.77300000000000002,0.67600000000000005,0.70199999999999996,0.76400000000000001,0.67900000000000005,0.69399999999999995,0.73699999999999999,0.66400000000000003,0.67800000000000005,0.73199999999999998,0.67100000000000004,0.68200000000000005,0.75,0.67100000000000004,0.66100000000000003,0.748,0.66300000000000003,0.69699999999999995,0.75,0.67700000000000005,0.69299999999999995,0.746,0.66900000000000004,0.69799999999999995,0.76800000000000002,0.69,0.72,0.755,0.71099999999999997,0.68799999999999994,0.752,0.68200000000000005,0.7,0.75,0.73499999999999999,0.71399999999999997,0.77,0.73]
[-20,0.69299999999999995,0.75900000000000001,0.65800000000000003,0.7,0.74399999999999999,0.66800000000000004,0.68500000000000005,0.74,0.67700000000000005,0.68200000000000005,0.747,0.67100000000000004,0.70299999999999996,0.76400000000000001,0.66900000000000004,0.69099999999999995,0.749,0.67,0.68600000000000005,0.73099999999999998,0.64700000000000002,0.67400000000000004,0.73099999999999998,0.66900000000000004,0.68700000000000006,0.752,0.67,0.67,0.751,0.66200000000000003,0.69799999999999995,0.754,0.67300000000000004,0.68799999999999994,0.746,0.66400000000000003,0.72,0.76800000000000002,0.69599999999999995,0.71599999999999997,0.75600000000000001,0.71299999999999997,0.69199999999999995,0.75,0.68899999999999995,0.69399999999999995,0.74399999999999999,0.72399999999999998,0.71799999999999997,0.77,0.72599999999999998]
[-10,0.69899999999999995,0.75900000000000001,0.65800000000000003,0.70699999999999996,0.748,0.66600000000000004,0.68600000000000005,0.74199999999999999,0.67600000000000005,0.67900000000000005,0.745,0.67100000000000004,0.7,0.76100000000000001,0.66900000000000004,0.68799999999999994,0.748,0.67,0.68899999999999995,0.72599999999999998,0.65100000000000002,0.67800000000000005,0.73299999999999998,0.66600000000000004,0.68400000000000005,0.75,0.67,0.66700000000000004,0.752,0.66200000000000003,0.69199999999999995,0.751,0.67700000000000005,0.69499999999999995,0.74399999999999999,0.66100000000000003,0.71299999999999997,0.77,0.69,0.71399999999999997,0.752,0.70199999999999996,0.69299999999999995,0.749,0.68600000000000005,0.69299999999999995,0.74299999999999999,0.72199999999999998,0.71299999999999997,0.76600000000000001,0.72399999999999998]
[0,0.69899999999999995,0.75800000000000001,0.65700000000000003,0.70599999999999996,0.745,0.66700000000000004,0.68600000000000005,0.73899999999999999,0.67200000000000004,0.68700000000000006,0.75,0.67300000000000004,0.70399999999999996,0.76300000000000001,0.67200000000000004,0.69299999999999995,0.75,0.67200000000000004,0.68500000000000005,0.73499999999999999,0.65100000000000002,0.67500000000000004,0.73099999999999998,0.66400000000000003,0.68100000000000005,0.75,0.67,0.66600000000000004,0.748,0.66200000000000003,0.69299999999999995,0.752,0.67100000000000004,0.69099999999999995,0.746,0.66200000000000003,0.70199999999999996,0.76800000000000002,0.69099999999999995,0.71499999999999997,0.748,0.70099999999999996,0.68899999999999995,0.752,0.68400000000000005,0.68799999999999994,0.74099999999999999,0.71599999999999997,0.70799999999999996,0.76400000000000001,0.72]
[10,0.70099999999999996,0.75700000000000001,0.66100000000000003,0.71,0.747,0.67700000000000005,0.69299999999999995,0.74099999999999999,0.69899999999999995,0.69,0.751,0.67700000000000005,0.70499999999999996,0.76400000000000001,0.67600000000000005,0.69199999999999995,0.752,0.67800000000000005,0.69399999999999995,0.73599999999999999,0.64800000000000002,0.69599999999999995,0.746,0.66300000000000003,0.72299999999999998,0.77100000000000002,0.66800000000000004,0.67500000000000004,0.75,0.65900000000000003,0.70299999999999996,0.75600000000000001,0.67100000000000004,0.7,0.747,0.66200000000000003,0.71399999999999997,0.76900000000000002,0.69499999999999995,0.71099999999999997,0.751,0.70299999999999996,0.69199999999999995,0.753,0.68300000000000005,0.68700000000000006,0.74099999999999999,0.71399999999999997,0.7,0.75700000000000001,0.71599999999999997]
[20,0.74099999999999999,0.77100000000000002,0.89900000000000002,0.73399999999999999,0.76300000000000001,0.89100000000000001,0.71299999999999997,0.75900000000000001,0.86099999999999999,0.71099999999999997,0.76900000000000002,0.89100000000000001,0.73,0.78100000000000003,0.91100000000000003,0.72499999999999998,0.77300000000000002,0.89800000000000002,0.80200000000000005,0.80900000000000005,0.69299999999999995,0.81200000000000006,0.82699999999999996,0.70099999999999996,0.82699999999999996,0.83,0.69699999999999995,0.81599999999999995,0.81499999999999995,0.68100000000000005,0.81599999999999995,0.82399999999999995,0.7,0.78300000000000003,0.79500000000000004,0.68700000000000006,0.7,0.76700000000000002,0.69,0.71099999999999997,0.746,0.69599999999999995,0.69499999999999995,0.755,0.68500000000000005,0.68100000000000005,0.73599999999999999,0.70199999999999996,0.71099999999999997,0.76,0.71499999999999997]
[30,0.75600000000000001,0.78600000000000003,0.86199999999999999,0.746,0.77200000000000002,0.89300000000000002,0.72099999999999997,0.76600000000000001,0.86499999999999999,0.73099999999999998,0.78400000000000003,0.91700000000000004,0.754,0.80500000000000005,0.92300000000000004,0.74299999999999999,0.78800000000000003,0.89800000000000002,0.84599999999999997,0.84199999999999997,0.72899999999999998,0.86899999999999999,0.86,0.74199999999999999,0.86199999999999999,0.85399999999999998,0.73599999999999999,0.86499999999999999,0.84199999999999997,0.71499999999999997,0.86599999999999999,0.85499999999999998,0.74199999999999999,0.83799999999999997,0.83099999999999996,0.72799999999999998,0.69099999999999995,0.77900000000000003,0.68400000000000005,0.71,0.751,0.68799999999999994,0.70299999999999996,0.78100000000000003,0.68,0.68600000000000005,0.745,0.70899999999999996,0.72099999999999997,0.78100000000000003,0.72499999999999998]
[40,0.76400000000000001,0.78800000000000003,0.85399999999999998,0.75,0.77600000000000002,0.879,0.72799999999999998,0.76700000000000002,0.84799999999999998,0.74099999999999999,0.78800000000000003,0.91600000000000004,0.77100000000000002,0.81399999999999995,0.91400000000000003,0.748,0.79800000000000004,0.89500000000000002,0.86199999999999999,0.85699999999999998,0.752,0.88500000000000001,0.872,0.77300000000000002,0.875,0.86399999999999999,0.76600000000000001,0.88,0.85099999999999998,0.74299999999999999,0.88200000000000001,0.86699999999999999,0.77900000000000003,0.85699999999999998,0.84099999999999997,0.77,0.75,0.82199999999999995,0.69899999999999995,0.74,0.77500000000000002,0.69799999999999995,0.73,0.80800000000000005,0.69799999999999995,0.69899999999999995,0.76100000000000001,0.72,0.75,0.80800000000000005,0.745]
[50,0.76500000000000001,0.78600000000000003,0.83299999999999996,0.75,0.77300000000000002,0.85899999999999999,0.72499999999999998,0.76600000000000001,0.84199999999999997,0.74399999999999999,0.78900000000000003,0.90900000000000003,0.77300000000000002,0.81399999999999995,0.90100000000000002,0.752,0.79700000000000004,0.89,0.871,0.86099999999999999,0.77700000000000002,0.89300000000000002,0.877,0.79300000000000004,0.88200000000000001,0.873,0.78800000000000003,0.88500000000000001,0.85499999999999998,0.77100000000000002,0.88300000000000001,0.874,0.8,0.86299999999999999,0.84599999999999997,0.79200000000000004,0.77100000000000002,0.84799999999999998,0.70799999999999996,0.77100000000000002,0.79700000000000004,0.72,0.749,0.83399999999999996,0.71299999999999997,0.72099999999999997,0.78500000000000003,0.74,0.77100000000000002,0.82499999999999996,0.77600000000000002]
[60,0.76800000000000002,0.78500000000000003,{"$f":"NA()","v":{"$error":"#N/A"}},0.75800000000000001,0.77600000000000002,{"$f":"NA()","v":{"$error":"#N/A"}},0.72899999999999998,0.76800000000000002,{"$f":"NA()","v":{"$error":"#N/A"}},0.746,0.79300000000000004,{"$f":"NA()","v":{"$error":"#N/A"}},0.77700000000000002,0.82299999999999995,{"$f":"NA()","v":{"$error":"#N/A"}},0.75600000000000001,0.80900000000000005,{"$f":"NA()","v":{"$error":"#N/A"}},0.87,0.86699999999999999,0.79600000000000004,0.9,0.88100000000000001,0.81,0.88900000000000001,0.874,0.80300000000000005,0.88700000000000001,0.86099999999999999,0.78300000000000003,0.88600000000000001,0.877,0.81200000000000006,0.86699999999999999,0.85,0.80700000000000005,0.77700000000000002,0.85799999999999998,0.71799999999999997,0.79800000000000004,0.81799999999999995,0.73899999999999999,0.77100000000000002,0.85,0.73399999999999999,0.75,0.80500000000000005,0.77,0.79200000000000004,0.83499999999999996,0.79700000000000004]
[70,0.77200000000000002,0.78500000000000003,{"$f":"NA()","v":{"$error":"#N/A"}},0.75900000000000001,0.77,{"$f":"NA()","v":{"$error":"#N/A"}},0.72599999999999998,0.76300000000000001,{"$f":"NA()","v":{"$error":"#N/A"}},0.752,0.79300000000000004,{"$f":"NA()","v":{"$error":"#N/A"}},0.77400000000000002,0.82399999999999995,{"$f":"NA()","v":{"$error":"#N/A"}},0.76,0.80500000000000005,{"$f":"NA()","v":{"$error":"#N/A"}},0.875,0.86599999999999999,0.80800000000000005,0.90400000000000003,0.88600000000000001,0.82299999999999995,0.89,0.879,0.81699999999999995,0.89400000000000002,0.86499999999999999,0.79700000000000004,0.89600000000000002,0.879,0.83599999999999997,0.86799999999999999,0.86099999999999999,0.82,0.76800000000000002,0.86599999999999999,0.746,0.81100000000000005,0.82799999999999996,0.754,0.79400000000000004,0.85899999999999999,0.75800000000000001,0.76500000000000001,0.82399999999999995,0.77500000000000002,0.80900000000000005,0.85,0.81200000000000006]
[80,0.76300000000000001,0.78300000000000003,{"$f":"NA()","v":{"$error":"#N/A"}},0.75700000000000001,0.76900000000000002,{"$f":"NA()","v":{"$error":"#N/A"}},0.72699999999999998,0.76500000000000001,{"$f":"NA()","v":{"$error":"#N/A"}},0.75,0.79100000000000004,{"$f":"NA()","v":{"$error":"#N/A"}},0.77800000000000002,0.82599999999999996,{"$f":"NA()","v":{"$error":"#N/A"}},0.75600000000000001,0.80300000000000005,{"$f":"NA()","v":{"$error":"#N/A"}},0.88200000000000001,0.876,0.81299999999999994,0.91200000000000003,0.89100000000000001,0.82699999999999996,0.89100000000000001,0.878,0.82599999999999996,0.88800000000000001,0.86499999999999999,0.80300000000000005,0.89900000000000002,0.88300000000000001,0.83299999999999996,0.873,0.86099999999999999,0.83399999999999996,0.78400000000000003,0.878,0.76200000000000001,0.82199999999999995,0.83799999999999997,0.77100000000000002,0.80200000000000005,0.872,0.77600000000000002,0.77600000000000002,0.82599999999999996,0.78800000000000003,0.81200000000000006,0.84799999999999998,0.82499999999999996]
{"$rows_left_out":14}
{"sheet":"FitMacro","index":1,"n_rows":52,"n_cols":19,"rows_kept":52,"cut":false,"hidden":false,"merged":[]}
["Fitting curve",null,null,"Counter",null,null,null,"y","Fit","RS",null,null,null,null,null,"Rmax","D","τ","C"]
["y = Rmax(1-exp((t-D)/τ) + C",null,null,51,null,"x",-30,{"$f":"IFERROR(INDEX(Data!$B$4:$AZ$28,ROW()-1,FitMacro!$D$2),\"\")","v":0.73},{"$f":"IF($G2>$E$12,$E$11*(1-EXP(-($G2-$E$12)/$E$13))+$E$14,$E$14)","v":0.72228364924621025},{"$f":"IFERROR((H2-I2)^2,\"\")","v":5.9542068955511426E-5},null,null,"2-DG","200601_17","GCL",7.152314433606495E-2,9.2339392147835877,11.07798032922901,0.69624978384974645]
[null,null,null,null,null,null,-20,{"$f":"IFERROR(INDEX(Data!$B$4:$AZ$28,ROW()-1,FitMacro!$D$2),\"\")","v":0.72599999999999998},0.72228364924621025,1.3811262925193511E-5,null,null,"2-DG","200601_17","IPL",2.6702171129370726E-2,19.430793862339559,0.93226223279635523,0.75879900006655854]
[null,null,null,"Drug",{"$f":"INDEX(Data!$B1:$AZ1,FitMacro!$D$2)","v":"Metformin"},null,-10,{"$f":"IFERROR(INDEX(Data!$B$4:$AZ$28,ROW()-1,FitMacro!$D$2),\"\")","v":0.72399999999999998},0.72228364924621025,2.945859910034576E-6,null,null,"2-DG","200601_17","PRS",0.20320030684853432,11.124901036663827,0.28399224140808121,0.65879911966709226]
[null,null,null,"DataID",{"$f":"INDEX(Data!$B2:$AZ2,FitMacro!$D$2)","v":"200522_18"},null,0,{"$f":"IFERROR(INDEX(Data!$B$4:$AZ$28,ROW()-1,FitMacro!$D$2),\"\")","v":0.72},0.72228364924621025,5.2150538797167486E-6,null,null,"2-DG","200601_18","GCL",5.5132935499994505E-2,7.6692509988874624,15.470748160489061,0.70274800815824734]
[null,null,null,"Layer",{"$f":"INDEX(Data!$B3:$AZ3,FitMacro!$D$2)","v":"PRS"},null,10,{"$f":"IFERROR(INDEX(Data!$B$4:$AZ$28,ROW()-1,FitMacro!$D$2),\"\")","v":0.71599999999999997},0.72228364924621025,3.948424784939898E-5,null,null,"2-DG","200601_18","IPL",2.7722069898948886E-2,9.5699517275882044,8.3691792485233503,0.74524886178809013]
[null,null,null,null,null,null,20,{"$f":"IFERROR(INDEX(Data!$B$4:$AZ$28,ROW()-1,FitMacro!$D$2),\"\")","v":0.71499999999999997},0.72228364924621025,5.3051546341819547E-5,null,null,"2-DG","200601_18","PRS",0.21325062860882055,9.9662379732474982,0.72036138502411018,0.66724973171128554]
[null,null,null,"Basal",0.69423865973823828,null,30,{"$f":"IFERROR(INDEX(Data!$B$4:$AZ$28,ROW()-1,FitMacro!$D$2),\"\")","v":0.72499999999999998},0.72228364924621025,7.3785614176140414E-6,null,null,"2-DG","200601_22","GCL",4.1565433319216208E-2,7.9958510691283484,11.130778300112537,0.6859993181759334]
[null,null,null,"MAX",0.77272079772079771,null,40,{"$f":"IFERROR(INDEX(Data!$B$4:$AZ$28,ROW()-1,FitMacro!$D$2),\"\")","v":0.745},0.74563206642183044,3.9950796160554351E-7,null,null,"2-DG","200601_22","IPL",2.4834705550381773E-2,18.633346096885866,1.0585603865197084,0.74100094106819436]
[null,null,null,null,null,null,50,{"$f":"IFERROR(INDEX(Data!$B$4:$AZ$28,ROW()-1,FitMacro!$D$2),\"\")","v":0.77600000000000002},0.77375546976037357,5.0379159965975789E-6,null,null,"2-DG","200601_22","PRS",0.17776447937868842,9.8906470123449033,0.80029547146874302,0.67624778246754869]
[null,null,null,"Rmax",0.16748887008097105,null,60,{"$f":"IFERROR(INDEX(Data!$B$4:$AZ$28,ROW()-1,FitMacro!$D$2),\"\")","v":0.79700000000000004},0.79639168473922883,3.700474564871432E-7,null,null,"2-DG","200608_19","GCL",6.5748508119510177E-2,12.297463879556172,15.246206364126905,0.68519916562143379]
[null,null,null,"D",33.083252883508337,null,70,{"$f":"IFERROR(INDEX(Data!$B$4:$AZ$28,ROW()-1,FitMacro!$D$2),\"\")","v":0.81200000000000006},0.81461132275390358,6.8190065250542754E-6,"START MACRO 'Fitting' TO SEE RESULTS",null,"2-DG","200608_19","IPL",4.5877303329192584E-2,8.9378042028953555,14.906849850958228,0.74724881280053612]
["EXCEPTION:",null,null,"τ",46.07211444629889,null,80,{"$f":"IFERROR(INDEX(Data!$B$4:$AZ$28,ROW()-1,FitMacro!$D$2),\"\")","v":0.82499999999999996},0.82927610702529631,1.8285091291788794E-5,"The data and fitting curve will be displayed",null,"2-DG","200608_19","PRS",0.24018910176334024,17.954986378523241,0.87151045319302034,0.67380479940395643]
["2-DG in PRS analyzed upto 50 min",null,null,"C",0.72228364924621025,null,90,{"$f":"IFERROR(INDEX(Data!$B$4:$AZ$28,ROW()-1,FitMacro!$D$2),\"\")","v":0.84399999999999997},0.8410796290026965,{"$f":"IFERROR((H14-I14)^2,\"\")","v":8.5285667618912489E-6},"one by one",null,"2-DG","200608_21","GCL",7.2756635497889896E-2,14.907850551268941,12.266525183907019,0.70479868767650333]
["to omit the recovery phase",null,null,null,null,null,100,{"$f":"IFERROR(INDEX(Data!$B$4:$AZ$28,ROW()-1,FitMacro!$D$2),\"\")","v":0.85099999999999998},0.85058015273987486,{"$f":"IFERROR((H15-I15)^2,\"\")","v":1.7627172183456753E-7},null,null,"2-DG","200608_21","IPL",6.0395859440865313E-2,14.906683116070752,15.553466530696889,0.76499959879346491]
{"$rows_left_out":38}
{"sheet":"Table","index":2,"n_rows":22,"n_cols":22,"rows_kept":22,"cut":false,"hidden":false,"merged":[]}
[null,null,null,"2-DG",null,null,"AICAR",null,null,"Metformin",null,null,null,null,"2-DG",null,null,"AICAR",null,null,"Metformin"]
[null,null,"GCL","IPL","PRS","GCL","IPL","PRS","GCL","IPL","PRS",null,null,"GCL","IPL","PRS","GCL","IPL","PRS","GCL","IPL","PRS"]
["Time constant","#1",{"$f":"FitMacro!R2","v":11.07798032922901},{"$f":"FitMacro!R3","v":0.93226223279635523},{"$f":"FitMacro!R4","v":0.28399224140808121},{"$f":"FitMacro!R20","v":11.655255818964557},{"$f":"FitMacro!R21","v":13.674352462923638},{"$f":"FitMacro!R22","v":36.729109209617143},{"$f":"FitMacro!R38","v":130.03117758952766},{"$f":"FitMacro!R39","v":27.795330592852704},{"$f":"FitMacro!R40","v":61.471817669427828},null,"Amplitude\n(ΔFRET/CFP)",{"$f":"C21&\" ± \"&C22","v":"0.062 ± 0.012"},"0.04 ± 0.015","0.22 ± 0.02","0.21 ± 0.02","0.13 ± 0.02","0.18 ± 0.01","0.22 ± 0.03","0.14 ± 0.02","0.18 ± 0.02"]
[null,"#2",{"$f":"FitMacro!R5","v":15.470748160489061},{"$f":"FitMacro!R6","v":8.3691792485233503},{"$f":"FitMacro!R7","v":0.72036138502411018},{"$f":"FitMacro!R23","v":12.562765435005913},{"$f":"FitMacro!R24","v":12.63941709581403},{"$f":"FitMacro!R25","v":30.443858042737101},{"$f":"FitMacro!R41","v":76.33955825293657},{"$f":"FitMacro!R42","v":34.045617205399374},{"$f":"FitMacro!R43","v":63.262519099528575},null,"Time constant\n(min)",{"$f":"C10&\" ± \"&C11","v":"13 ± 2"},"9.4 ± 7.1","0.88 ± 0.53","11 ± 1","14 ± 1","33 ± 3","84 ± 29","37 ± 8","62 ± 10"]
[null,"#3",{"$f":"FitMacro!R8","v":11.130778300112537},{"$f":"FitMacro!R9","v":1.0585603865197084},{"$f":"FitMacro!R10","v":0.80029547146874302},{"$f":"FitMacro!R26","v":10.69742545212878},{"$f":"FitMacro!R27","v":13.409451695093544},{"$f":"FitMacro!R28","v":34.871630499350076},{"$f":"FitMacro!R44","v":83.779860274823335},{"$f":"FitMacro!R45","v":41.264041002784985},{"$f":"FitMacro!R46","v":69.460664310445438}]
[null,"#4",{"$f":"FitMacro!R11","v":15.246206364126905},{"$f":"FitMacro!R12","v":14.906849850958228},{"$f":"FitMacro!R13","v":0.87151045319302034},{"$f":"FitMacro!R29","v":9.4826393793004069},{"$f":"FitMacro!R30","v":12.566836436163166},{"$f":"FitMacro!R31","v":34.336292815111285},{"$f":"FitMacro!R47","v":78.7875437198893},{"$f":"FitMacro!R48","v":47.752523399676733},{"$f":"FitMacro!R49","v":71.772791318668482}]
[null,"#5",{"$f":"FitMacro!R14","v":12.266525183907019},{"$f":"FitMacro!R15","v":15.553466530696889},{"$f":"FitMacro!R16","v":1.872916221565756},{"$f":"FitMacro!R32","v":11.306269056216466},{"$f":"FitMacro!R33","v":13.066811033971359},{"$f":"FitMacro!R34","v":29.554132021444882},{"$f":"FitMacro!R50","v":51.388768036325736},{"$f":"FitMacro!R51","v":32.898278190062825},{"$f":"FitMacro!R52","v":46.07211444629889}]
[null,"#6",{"$f":"FitMacro!R17","v":14.762405267710987},{"$f":"FitMacro!R18","v":15.732652211824263},{"$f":"FitMacro!R19","v":0.75331464798138681},{"$f":"FitMacro!R35","v":12.923478389374054},{"$f":"FitMacro!R36","v":16.457274602958648},{"$f":"FitMacro!R37","v":29.815074923504334},null,null,null,null,null,null,"2-DG","AICAR","Metformin"]
[null,null,null,null,null,null,null,null,null,null,null,null,null,"GCL",{"$f":"C21&\" ± \"&C22","v":"0.062 ± 0.012"},{"$f":"F21&\" ± \"&F22","v":"0.21 ± 0.02"},{"$f":"I21&\" ± \"&I22","v":"0.22 ± 0.03"}]
["mean",null,{"$f":"ROUND(AVERAGE(C3:C8),0)","v":13},{"$f":"ROUND(AVERAGE(D3:D8),1)","v":9.4},{"$f":"ROUND(AVERAGE(E3:E8),2)","v":0.88},{"$f":"ROUND(AVERAGE(F3:F8),0)","v":11},14,33,84,37,62,null,"Amplitude\n(ΔFRET/CFP)","IPL",{"$f":"D21&\" ± \"&D22","v":"0.04 ± 0.015"},{"$f":"G21&\" ± \"&G22","v":"0.13 ± 0.02"},{"$f":"J21&\" ± \"&J22","v":"0.14 ± 0.02"}]
["SD",null,{"$f":"ROUND(STDEV(C3:C8),0)","v":2},{"$f":"ROUND(STDEV(D3:D8),1)","v":7.1},{"$f":"ROUND(STDEV(E3:E8),2)","v":0.53},{"$f":"ROUND(STDEV(F3:F8),0)","v":1},1,3,29,8,10,null,null,"PRS",{"$f":"E21&\" ± \"&E22","v":"0.22 ± 0.02"},{"$f":"H21&\" ± \"&H22","v":"0.18 ± 0.01"},{"$f":"K21&\" ± \"&K22","v":"0.18 ± 0.02"}]
[]
[null,null,null,null,null,null,null,null,null,null,null,null,null,"GCL",{"$f":"C10&\" ± \"&C11","v":"13 ± 2"},{"$f":"F10&\" ± \"&F11","v":"11 ± 1"},{"$f":"I10&\" ± \"&I11","v":"84 ± 29"}]
["Amplitude","#1",{"$f":"FitMacro!P2","v":7.152314433606495E-2},{"$f":"FitMacro!P3","v":2.6702171129370726E-2},{"$f":"FitMacro!P4","v":0.20320030684853432},{"$f":"FitMacro!P20","v":0.18968249941118079},{"$f":"FitMacro!P21","v":0.14022334626268473},{"$f":"FitMacro!P22","v":0.19191685319372603},{"$f":"FitMacro!P38","v":0.21599165418489152},{"$f":"FitMacro!P39","v":0.13426593769361705},{"$f":"FitMacro!P40","v":0.17561717783364322},null,"Time constant\n(min)","IPL",{"$f":"D10&\" ± \"&D11","v":"9.4 ± 7.1"},{"$f":"G10&\" ± \"&G11","v":"14 ± 1"},{"$f":"J10&\" ± \"&J11","v":"37 ± 8"}]
[null,"#2",{"$f":"FitMacro!P5","v":5.5132935499994505E-2},{"$f":"FitMacro!P6","v":2.7722069898948886E-2},{"$f":"FitMacro!P7","v":0.21325062860882055},{"$f":"FitMacro!P23","v":0.23095135028504021},{"$f":"FitMacro!P24","v":0.15605351718307131},{"$f":"FitMacro!P25","v":0.18306995648650518},{"$f":"FitMacro!P41","v":0.23075178344561331},{"$f":"FitMacro!P42","v":0.12271091959406318},{"$f":"FitMacro!P43","v":0.16869817479722002},null,null,"PRS",{"$f":"E10&\" ± \"&E11","v":"0.88 ± 0.53"},{"$f":"H10&\" ± \"&H11","v":"33 ± 3"},{"$f":"K10&\" ± \"&K11","v":"62 ± 10"}]
{"$rows_left_out":7}